{"text_format":"1","workbook":"xlsx","n_sheets":9,"sheets":["Couverture","Instructions","Définitions","Données Nationales","Métadonnées","ODD 6.4.1","ODD 6.4.2","Feedback","(Hidden) Other SDG data"],"not_rendered":{"charts":0,"images":2,"macros":1,"external_links":0,"defined_names":8,"comments":0,"pivot_tables":0},"unopened":[],"bounds":{"document_bytes":16777216,"sheet_cells":100000,"rows_first":2000,"rows_last":500,"rows_between":2000,"halvings":0,"cell_chars":16384,"cell_head_chars":4096},"cells_cut":0,"cells_raw":0,"read":"whole","date_system":"1900"}

{"sheet":"Couverture","index":0,"n_rows":48,"n_cols":1,"rows_kept":48,"cut":false,"hidden":false,"merged":[[31,0,31,1],[31,2,31,8],[28,0,28,1],[28,2,28,8],[29,0,29,1],[29,2,29,8],[30,0,30,1],[30,2,30,8],[46,0,46,8],[47,0,47,8],[41,0,41,8],[42,0,42,8],[34,0,34,1],[34,2,34,8],[32,2,32,8],[33,0,33,1],[33,2,33,8],[44,0,44,8],[45,0,45,8],[7,0,7,8],[6,0,6,4],[6,5,6,8],[40,0,40,8],[39,0,39,8],[23,0,23,1],[23,2,23,8],[10,0,10,8],[22,0,22,1],[22,2,22,8],[25,0,25,8],[26,0,26,1],[26,2,26,8],[27,0,27,1],[27,2,27,8],[32,0,32,1],[9,0,9,8],[12,0,12,8],[20,2,20,8],[21,0,21,1],[21,2,21,8],[3,0,3,8],[4,0,4,8],[38,0,38,8],[36,0,36,8],[14,0,14,8],[15,2,15,8],[16,2,16,8],[16,0,16,1],[15,0,15,1],[17,0,17,1],[17,2,17,8],[18,0,18,1],[18,2,18,8],[19,0,19,1],[19,2,19,8],[20,0,20,1]]}
[]
[]
[]
["Questionnaire Eau et Agriculture 2019"]
["Collecte de données AQUASTAT sur l'utilisation de l'eau pour l'agriculture et le développement rural"]
[]
["Pays: "]
["Années civiles de référence: de 2015 à 2017"]
[]
["Objet du questionnaire"]
["Les données recueillies dans le cadre de ce questionnaire visent à fournir une image complète des ressources et des utilisations de l'eau aux niveaux national et sous-national et à décrire leurs principales caractéristiques, tendances, contraintes et perspectives, en accordant une attention particulière au secteur agricole. En particulier, les données collectées devraient:\n\n- Permettre la mise à jour de la base de données AQUASTAT, qui est le système mondial d'information de référence publique sur l'eau géré par la FAO. Depuis 1994, AQUASTAT fournit des informations de qualité sur les ressources en eau et l'utilisation de l'eau dans chaque pays et les met à la disposition des utilisateurs dans un format standard. Il se concentre sur les pays en développement d'Afrique, d'Asie, d'Amérique latine et des Caraïbes. Les données et rapports d'AQUASTAT sont disponibles sur http://www.fao.org/aquastat.\n\n- Suivre les indicateurs relatifs aux objectifs de développement durable liés à l'eau (ODD) 6.4.1 (efficacité de l'eau) et 6.4.2 (stress hydrique), dont la FAO est responsable du suivi.\n\n- Soutenir les analyses sur l'eau en agriculture et servir d'outil majeur pour la planification à grande échelle et les études prédictives.\n\n- Fournir aux décideurs des informations complètes sur l'état de la gestion de l'eau dans le pays à travers le monde.\n"]
[]
["Veuillez compléter ou mettre à jour les coordonnées du correspondent national AQUASTAT responsable de ce questionnaire dans votre pays."]
[]
["Correspondent national AQUASTAT"]
{"$rows_left_out":34}
{"sheet":"Instructions","index":1,"n_rows":66,"n_cols":3,"rows_kept":66,"cut":false,"hidden":false,"merged":[[57,0,57,8],[18,2,18,9],[20,2,20,9],[62,0,62,1],[65,0,65,1],[65,2,65,9],[62,2,62,9],[61,0,61,1],[61,2,61,9],[63,0,63,1],[63,2,63,9],[64,0,64,1],[64,2,64,9],[61,10,61,11],[59,0,59,1],[60,0,60,1],[58,2,58,9],[59,2,59,9],[60,2,60,9],[58,0,58,1],[3,0,3,9],[7,0,7,9],[12,0,12,1],[18,0,18,1],[20,0,20,1],[14,0,14,1],[16,0,16,1],[5,0,5,9],[10,0,10,1],[14,2,14,9],[16,2,16,9],[10,2,10,9],[8,0,8,1],[8,2,8,9],[12,2,12,9]]}
[]
[]
[]
["INSTRUCTIONS"]
[]
["Les utilisateurs sont priés de lire ces instructions avant de commencer à remplir le questionnaire"]
[]
["Instructions Générales"]
["Coherence des données ",null,"Avant de soumettre le questionnaire, veuillez controler la cohérence et l'uniformité en recoupant les variables. Par exemple, la somme des zones équipées pour l'irrigation au niveau sous-national doit correspondre à la superficie totale équipée pour l'irrigation au niveau national. Veuillez prêter une attention particulière au double comptage."]
[]
["Format électronique",null,"Ce questionnaire est fourni au format .xlsx. L'option préférée est de le compléter dans ce format électronique pour le renvoyer par email.\nVeuillez noter que la structure du questionnaire est telle qu'une fois vérifiée, elle peut être introduite automatiquement dans la base de données informatisée. Pour être en mesure de le faire, il est important que le rapporteur utilise le questionnaire tel qu'il est et n'en modifie pas la structure ni ne copie les différentes feuilles de travail dans d'autres fichiers."]
[]
["Standards et classifications internationaux",null,"Ce questionnaire est conforme au Système de Comptabilite Economique et Environmental pour l'Eau (SCEE-Eau) (https://unstats.un.org/unsd/envaccounting/seeaw/) et reprend également certaines définitions du Volume 1 du Programme du recensement mondiale de l'agriculture 2020 (RMA)(http://www.fao.org/world-census-agriculture)."]
[]
["Année civile",null,"Veuillez communiquer les données par année civile (janvier à decembre) dans les colonnes prévues à cet effet."]
{"$rows_left_out":52}
{"sheet":"Définitions","index":2,"n_rows":111,"n_cols":2,"rows_kept":111,"cut":false,"hidden":false,"merged":[[103,0,103,9],[105,1,105,9],[108,0,108,9],[110,1,110,9],[0,0,2,9],[80,1,80,9],[100,1,100,9],[94,1,94,9],[74,1,74,9],[61,1,61,9],[4,0,4,9],[18,1,18,9],[27,1,27,9],[7,0,7,9],[11,1,11,9],[57,1,57,9],[78,1,78,9],[65,1,65,9],[70,0,70,9],[71,0,71,9],[15,0,15,9],[51,1,51,9],[53,1,53,9],[38,1,38,9],[55,1,55,9],[22,1,22,9],[20,1,20,9],[24,1,24,9],[84,1,84,9],[86,1,86,9],[88,1,88,9],[82,1,82,9],[90,1,90,9],[96,1,96,9],[42,1,42,9],[25,1,25,9],[34,1,34,9],[29,1,29,9],[32,1,32,9],[36,1,36,9],[63,1,63,9],[41,1,41,9],[46,1,46,9],[48,1,48,9],[44,1,44,9],[69,0,69,9],[95,1,95,9],[92,1,92,9],[76,1,76,9]]}
[]
[]
[]
[]
["DÉFINITIONS"]
[]
["I. Ressources en eau"]
["Les données AQUASTAT sur les ressources en eau sont des moyennes nationales inter-annuelles des ressources en eau renouvelables. De l’information détaillée sur les ressources en eau ainsi que des définitions peuvent être trouvées sur la page internet d'AQUASTAT sur les ressources en eau à: http://www.fao.org/aquastat/fr/overview/methodology/water-resources.\nLes définitions des ressources en eau dans cette section suivent les unités statistiques de l'environnement et les éléments de données physiques pour les flux entrant et sortant du territoire des Normes Internationales des Ressources en Eau."]
[]
["0.1. Ressources en eau"]
["011","Ressources en eau renouvelables totales (109=10^9 m3/an)"]
[null,"Les ressources en eau renouvelables totales sont égales à la somme des ressources en eau renouvelables intérieures et extérieures. Elles correspondent au volume d'eau annuel théorique maximal dont dispose un pays à un moment donné."]
[]
[]
["I. Prélèvement et utilisation d'eau "]
{"$rows_left_out":97}
{"sheet":"Données Nationales","index":3,"n_rows":62,"n_cols":9,"rows_kept":62,"cut":false,"hidden":false,"merged":[[23,8,23,9],[22,8,22,9],[21,8,21,9],[31,8,31,9],[30,8,30,9],[29,8,29,9],[28,8,28,9],[27,8,27,9],[36,8,36,9],[35,8,35,9],[34,8,34,9],[33,8,33,9],[32,8,32,9],[41,8,41,9],[40,8,40,9],[39,8,39,9],[38,8,38,9],[37,8,37,9],[54,8,54,9],[53,8,53,9],[52,8,52,9],[51,8,51,9],[45,8,45,9],[61,8,61,9],[60,8,60,9],[58,8,58,9],[57,8,57,9],[55,8,55,9],[42,4,53,4],[36,4,38,4],[28,4,33,4],[12,8,12,9],[13,8,13,9],[15,8,15,9],[16,8,16,9],[17,8,17,9],[50,8,50,9],[49,8,49,9],[48,8,48,9],[47,8,47,9],[46,8,46,9],[44,8,44,9],[43,8,43,9],[42,8,42,9],[18,4,26,4],[26,5,26,6],[14,5,14,6],[3,1,3,9],[0,1,2,9],[5,1,5,9],[7,1,7,9],[9,1,9,9],[10,1,10,9],[14,8,14,9],[26,8,26,9],[20,8,20,9],[19,8,19,9],[18,8,18,9],[25,8,25,9],[24,8,24,9]]}
[]
[]
[]
[null,"DONNÉES NATIONALES"]
[]
[null,"Merci de fournir les valeurs nationales pour les variables suivantes dans l'unité spécifiée pour 2015, 2016 et 2017. Attention: l'année à laquelle les données se réfèrent peut différer de l'année de publication."]
[null,"Si la valeur inclut des décimales, merci d'utiliser un point et non une virgule, par exemple 0.0001 et NON 0,0001."]
[null,"Veuillez inscrire:\n   0    (zéro) pour un zéro absolu ou arrondi pour des variables qui pourraient s'appliquer à votre pays\n   C    pour des données qui ne peuvent pas être reportées pour des raisons confidentielles \nNA    pour des données non disponibles (c'est-à-dire pour des données qui existent mais qui ne sont pas reportées pour diverses raisons, excluant la confidentialité pour laquelle “C” doit être utilisé)\n    :    pour des données non applicables, qui ne peuvent pas exister dans votre pays."]
[null,"La définition des variables est fournit dans la page précédente \"Définitions\", et les unités de conversion sont indiquées dans la page \"Instructions\"."]
[null,"Pour chaque valeur, merci de fournir les métadonnées correspondentes en cliquant sur le lien dans le colonne \"Métadonnées\": il vous dirigera vers la partie correspondant à la variable dans la page \"Métadonnées\"."]
[null,"Si une valeur insérée apparait en rouge, veuillez vérifier la valeur et effectuez une vérification croisée entre les variables pour éviter les erreurs (par exemple, double comptage, addition non égale à la somme des composants ou valeur supérieure à l'un de ses composants)."]
[]
["I",0,null,"Ressources en eau"]
[null,"0.1. ",null,null,"Unité",2015,2016,2017,"Métadonnées"]
[4197,"011",4197,"Ressources en eau renouvelables totales (moyenne sur le long terme)","10^9 m3/an",null,null,null,"Cliquer pour ajouter des métadonnées sur 011"]
{"$rows_left_out":48}
{"sheet":"Métadonnées","index":4,"n_rows":258,"n_cols":4,"rows_kept":258,"cut":false,"hidden":false,"merged":[[10,2,10,3],[11,2,11,3],[12,2,12,3],[13,2,13,3],[14,2,14,3],[15,2,15,3],[16,2,16,3],[17,2,17,3],[18,2,18,3],[38,0,40,0],[38,2,38,3],[39,2,39,3],[40,2,40,3],[63,2,63,3],[64,0,65,0],[64,1,65,1],[64,2,64,3],[65,2,65,3],[60,2,60,3],[61,2,61,3],[51,2,51,3],[52,0,54,0],[52,2,52,3],[53,2,53,3],[54,2,54,3],[56,2,56,3],[57,0,58,0],[57,1,58,1],[57,2,57,3],[58,2,58,3],[59,0,61,0],[59,2,59,3],[43,1,44,1],[23,2,23,3],[24,0,26,0],[24,2,24,3],[25,2,25,3],[26,2,26,3],[35,2,35,3],[36,0,37,0],[36,1,37,1],[36,2,36,3],[37,2,37,3],[28,2,28,3],[29,0,30,0],[29,1,30,1],[29,2,29,3],[30,2,30,3],[31,0,33,0],[31,2,31,3],[32,2,32,3],[33,2,33,3],[249,2,249,3],[250,2,250,3],[252,2,252,3],[253,0,254,0],[253,1,254,1],[253,2,253,3],[254,2,254,3],[255,0,257,0],[255,2,255,3],[256,2,256,3],[257,2,257,3],[248,0,250,0],[248,2,248,3],[155,2,155,3],[156,2,156,3],[157,0,159,0],[157,2,157,3],[158,2,158,3],[159,2,159,3],[238,2,238,3],[239,0,240,0],[239,1,240,1],[239,2,239,3],[240,2,240,3],[224,2,224,3],[225,0,226,0],[225,1,226,1],[225,2,225,3],[226,2,226,3],[227,0,229,0],[227,2,227,3],[228,2,228,3],[229,2,229,3],[166,2,166,3],[168,2,168,3],[169,0,170,0],[169,1,170,1],[169,2,169,3],[170,2,170,3],[171,0,173,0],[171,2,171,3],[172,2,172,3],[173,2,173,3],[211,2,211,3],[212,2,212,3],[213,0,215,0],[213,2,213,3],[214,2,214,3],[215,2,215,3],[192,0,194,0],[192,2,192,3],[193,2,193,3],[194,2,194,3],[196,2,196,3],[197,0,198,0],[197,1,198,1],[197,2,197,3],[198,2,198,3],[199,0,201,0],[199,2,199,3],[200,2,200,3],[201,2,201,3],[203,2,203,3],[204,0,205,0],[204,1,205,1],[204,2,204,3],[205,2,205,3],[206,0,208,0],[206,2,206,3],[207,2,207,3],[208,2,208,3],[148,2,148,3],[149,2,149,3],[150,0,152,0],[150,2,150,3],[151,2,151,3],[152,2,152,3],[189,2,189,3],[190,0,191,0],[190,1,191,1],[190,2,190,3],[191,2,191,3],[148,0,149,0],[148,1,149,1],[182,2,182,3],[183,0,184,0],[183,1,184,1],[183,2,183,3],[184,2,184,3],[185,0,187,0],[185,2,185,3],[186,2,186,3],[187,2,187,3],[154,2,154,3],[155,0,156,0],[127,0,128,0],[127,1,128,1],[127,2,127,3],[128,2,128,3],[107,2,107,3],[108,0,110,0],[108,2,108,3],[109,2,109,3],[110,2,110,3],[119,2,119,3],[120,0,121,0],[120,1,121,1],[120,2,120,3],[121,2,121,3],[122,0,124,0],[122,2,122,3],[123,2,123,3],[101,2,101,3],[102,2,102,3],[103,2,103,3],[105,2,105,3],[106,0,107,0],[106,1,107,1],[106,2,106,3],[124,2,124,3],[126,2,126,3],[84,2,84,3],[85,0,86,0],[85,1,86,1],[85,2,85,3],[86,2,86,3],[87,0,89,0],[87,2,87,3],[88,2,88,3],[89,2,89,3],[70,2,70,3],[71,0,72,0],[71,1,72,1],[71,2,71,3],[72,2,72,3],[73,0,75,0],[73,2,73,3],[74,2,74,3],[75,2,75,3],[77,2,77,3],[78,0,79,0],[78,1,79,1],[78,2,78,3],[79,2,79,3],[80,0,82,0],[80,2,80,3],[81,2,81,3],[82,2,82,3],[66,0,68,0],[66,2,66,3],[67,2,67,3],[68,2,68,3],[3,0,3,3],[6,0,6,3],[7,0,7,3],[43,0,44,0],[45,0,47,0],[42,2,42,3],[43,2,43,3],[44,2,44,3],[45,2,45,3],[46,2,46,3],[47,2,47,3],[49,2,49,3],[5,0,5,3],[21,2,21,3],[22,0,23,0],[22,1,23,1],[22,2,22,3],[50,0,51,0],[50,1,51,1],[50,2,50,3],[91,2,91,3],[92,0,93,0],[92,1,93,1],[115,0,117,0],[115,2,115,3],[116,2,116,3],[117,2,117,3],[92,2,92,3],[93,2,93,3],[94,0,96,0],[94,2,94,3],[95,2,95,3],[96,2,96,3],[112,2,112,3],[113,0,114,0],[113,1,114,1],[113,2,113,3],[114,2,114,3],[98,2,98,3],[99,0,100,0],[99,1,100,1],[99,2,99,3],[100,2,100,3],[101,0,103,0],[140,2,140,3],[129,0,131,0],[129,2,129,3],[130,2,130,3],[131,2,131,3],[133,2,133,3],[134,0,135,0],[134,1,135,1],[134,2,134,3],[135,2,135,3],[136,0,138,0],[136,2,136,3],[137,2,137,3],[138,2,138,3],[141,0,142,0],[141,1,142,1],[141,2,141,3],[142,2,142,3],[143,0,145,0],[143,2,143,3],[144,2,144,3],[145,2,145,3],[147,2,147,3],[221,2,221,3],[222,2,222,3],[161,2,161,3],[162,0,163,0],[162,1,163,1],[162,2,162,3],[163,2,163,3],[164,0,166,0],[164,2,164,3],[165,2,165,3],[217,2,217,3],[218,0,219,0],[218,1,219,1],[218,2,218,3],[219,2,219,3],[175,2,175,3],[176,0,177,0],[176,1,177,1],[176,2,176,3],[177,2,177,3],[178,0,180,0],[178,2,178,3],[179,2,179,3],[180,2,180,3],[155,1,156,1],[241,0,243,0],[241,2,241,3],[242,2,242,3],[243,2,243,3],[245,2,245,3],[246,0,247,0],[246,1,247,1],[246,2,246,3],[247,2,247,3],[231,2,231,3],[232,0,233,0],[232,1,233,1],[232,2,232,3],[233,2,233,3],[234,0,236,0],[234,2,234,3],[235,2,235,3],[236,2,236,3],[210,2,210,3],[211,0,212,0],[211,1,212,1],[220,0,222,0],[220,2,220,3]]}
[]
[]
[]
["MÉTADONNÉES"]
[]
["Cette section recueille, pour chaque donnée fournie, les métadonnées correspondantes relatives à la source, les moyens de diffusion et les commentaires spécifiques."]
["Veuillez compléter les trois types d'informations (source de données, diffusion de données et métadonnées) pour chaque variable. Pour chaque type d'information, veuillez d'abord sélectionner une catégorie dans le menu déroulant des cellules bleues (options énumérées ci-dessous), puis spécifier toute information / tout commentaire dans la colonne «Veuillez préciser» située à côté."]
["Veuillez cliquer sur \"Retour aux données\" pour revenir à la variable correspondante dans la page \"Données nationales\"."]
[]
["1. Source de données"," 2. Diffusion de données","3. Métadonnées"]
["1.1 Recensement","2.1 Base de données","3.1 Région de référence: Couverture géographique, par exemple: \"A l'exclusion de l'Ile X\" or \"Inclut uniquement la ville X\""]
["1.2 Enquête","2.2 Annuaire statistique","3.2 Période de référence:  Couverture temporelle, par exemple: \"Données de 2010 considérée comme encore valide\""]
["1.3 Données administrative / registres","2.3 Bulletin statistique","3.3 Comparabilité (géographique): Rupture dans la couverture géographique, par exemple: \"Donnée exclut la région X indépendante depuis peu\""]
["1.4 Estimations (veuillez indiquer la méthodologie)","2.4 Autre publication statistique ","3.4 Comparabilité (temporelle): Rupture dans la série chronologique, par exemple: \"Irrigation pratiquée dans les serres est inclus depuis 2005\""]
["1.5 Inconnu","2.5 Rapport","3.5 Ajustment: Changement par rapport à la source/référence de la donnée, par exemple: \"Superficie indiquée en acres dans la source, convertie en ha avec le ratio acre= x*n ha\""]
{"$rows_left_out":244}
{"sheet":"ODD 6.4.1","index":5,"n_rows":66,"n_cols":11,"rows_kept":66,"cut":false,"hidden":false,"merged":[[3,0,3,9],[5,1,5,9],[59,3,61,3],[62,3,63,3]]}
[]
[]
[]
["CALCUL DE L'INDICATEUR ODD 6.4.1 SUR L'EFFICACITÉ DE L'EAU (en $EU/m3)"]
[null,null,null,null,null,null,null,null,null,null," "]
[null,"Cette feuille est un outil permettant de calculer automatiquement l'indicateur ODD 6.4.1 sur l'efficacité d'utilisation de l'eau. Veuillez ne pas toucher: aucune compilation n'est requise. Elle est automatiquement remplie à partir des données de la feuille de calcul \"Données nationales\", ainsi que quelques données additionnelles (voir tableau ci-dessous). Si l'indicateur n'est pas calculé, trop de variables manquent: vérifiez si vous pouvez renseigner davantage de variables dans la feuille \"Données nationales\". Les cellules bleu vif sont calculées à partir des cellules bleu grisé."]
[]
[null,null,null,null,null,null,null,null,"Année",{"$f":"LOOKUP(2,1/('Données Nationales'!F20:H20),'Données Nationales'!F18:H18)","v":{"$error":"#N/A"}}]
[]
[null,"EFFICACITÉ DE L'UTILISATION DE L'EAU PAR L'AGRICULTURE IRRIGUÉE (Awe)",null,null,null,null,null,"UNITÉ","FORMULES DE CALCUL"]
[]
[null,null,"Ratio entre les rendements pluviaux et irrigués",null,null,"[1]",{"$f":"I65","v":0},"décimale","Données AQUASTAT (ci-dessous) utilisées si aucune entrée"]
[]
[null,null,"Proportion des terres irriguées sur les terres arables totales (Ai)",null,null,"[2]",{"$f":"IF(OR(G15=\"\",G15=0), 0, (G15/G16))","v":{"$error":"#N/A"}},"décimale","=[3]/[4]"]
[null,null,null,"Terres irriguées",null,"[3]",{"$f":"LOOKUP(2,1/(ISNUMBER('Données Nationales'!F56:H56)),'Données Nationales'!F56:H56)","v":{"$error":"#N/A"}},"1000 ha"]
{"$rows_left_out":52}
{"sheet":"ODD 6.4.2","index":6,"n_rows":32,"n_cols":11,"rows_kept":32,"cut":false,"hidden":false,"merged":[[29,2,29,3],[30,2,30,3],[3,0,3,9],[5,1,5,9],[11,8,11,9],[17,8,17,9],[19,8,19,9],[28,2,28,3]]}
[]
[]
[]
["CALCUL DE L'INDICATEUR 6.4.2 SUR LE STRESS HYDRIQUE (en %)"]
[]
[null,"Cette feuille est un outil permettant de calculer automatiquement l'indicateur ODD 6.4.2 sur le stress hydrique. Veuillez ne pas toucher: aucune compilation n'est requise. Elle est automatiquement remplie à partir des données de la feuille de calcul \"Données nationales\", ainsi que quelques données additionnelles (voir tableau ci-dessous) utilisées comme valeur par défaut. Si l'indicateur n'est pas calculé, trop de variables manquent: vérifiez si vous pouvez renseigner davantage de variables dans la feuille \"Données nationales\"."]
[]
[null,null,null,null,null,null,null,null,"Année",{"$f":"LOOKUP(2,1/('Données Nationales'!F19:H19),'Données Nationales'!F18:H18)","v":{"$error":"#N/A"}}," "]
[]
[null,"STRESS HYDRIQUE",null,null,null,null,null,"UNITÉ",null,"FORMULES DE CALCUL"]
[]
[null,null,"Prélèvements d'eau douce (eau superficielle + souterraine)",null,null,"[1]",{"$f":"IF(AND('Données Nationales'!F29=\"\",'Données Nationales'!G29=\"\",'Données Nationales'!H29=\"\"), SUM(G13-G14-G15-G16), LOOKUP(2,1/(ISNUMBER('Données Nationales'!F29:H29)),'Données Nationales'!F29:H29))","v":{"$error":"#N/A"}},"10^9 m3","=[2]-[3]-[4]-[5] si manque sur la feuille \"Données Nationales\" "]
[null,null,null,"Prélèvements en eau totaux",null,"[2]",{"$f":"LOOKUP(2,1/(ISNUMBER('Données Nationales'!F19:H19)),'Données Nationales'!F19:H19)","v":{"$error":"#N/A"}},"10^9 m3",{"$f":"IF(G13=('ODD 6.4.1'!G23+'ODD 6.4.1'!G32+'ODD 6.4.1'!G40),\"OK\",\"ERROR\")","v":{"$error":"#N/A"}}]
[null,null,null,"Eau dessalée produite",null,"[3]",{"$f":"LOOKUP(2,1/(ISNUMBER('Données Nationales'!F32:H32)),'Données Nationales'!F32:H32)","v":{"$error":"#N/A"}},"10^9 m3"]
[null,null,null,"Utilisation directe d'eaux usées muncipales traitées",null,"[4]",{"$f":"LOOKUP(2,1/(ISNUMBER('Données Nationales'!F33:H33)),'Données Nationales'!F33:H33)","v":{"$error":"#N/A"}},"10^9 m3"]
{"$rows_left_out":18}
{"sheet":"Feedback","index":7,"n_rows":66,"n_cols":9,"rows_kept":66,"cut":false,"hidden":false,"merged":[[38,8,38,9],[44,2,45,2],[44,3,45,3],[44,4,45,4],[44,5,45,5],[44,6,45,6],[45,8,45,9],[37,2,38,2],[37,3,38,3],[37,4,38,4],[37,5,38,5],[37,6,38,6],[31,8,31,9],[23,2,24,2],[23,3,24,3],[23,4,24,4],[23,5,24,5],[23,6,24,6],[30,2,31,2],[30,3,31,3],[30,4,31,4],[30,5,31,5],[30,6,31,6],[67,1,67,8],[11,0,11,1],[11,8,11,12],[18,0,18,1],[18,8,18,12],[39,0,39,1],[39,8,39,12],[46,8,46,12],[51,1,51,8],[55,1,55,8],[59,1,59,8],[63,1,63,8],[46,0,46,1],[16,2,17,2],[16,3,17,3],[16,4,17,4],[3,0,3,13],[5,0,5,13],[25,8,25,12],[32,0,32,1],[32,8,32,12],[25,0,25,1],[10,8,10,13],[9,2,10,2],[9,3,10,3],[9,4,10,4],[9,5,10,5],[9,6,10,6],[16,5,17,5],[16,6,17,6],[17,8,17,9],[24,8,24,9]]}
[]
[]
[]
["FEEDBACK"]
[]
["La méthodologie utilisée dans ce questionnaire est régulièrement examinée pour améliorer son efficacité, réduire la charge de travail et identifier les domaines à améliorer. Les commentaires des évaluateurs sont donc particulièrement appréciés et encouragés.\nDans le cas où plus d'un répondant a contribué à la compilation du questionnaire, cette feuille de travail doit être remplie par lecorrespondent national (indiqué sur la page de couverture) en recueillant cette information auprès de tous les contributeurs."]
[]
["1. Le questionnaire a été envoyé au personnel approprié"]
[]
[null,null,"Tout a fait d'accord","D'accord","Partiel-lement d'accord","Pas d'accord","Pas du tout d'accord"]
[null,null,null,null,null,null,null,null,"Veuillez préciser la bonne personne, sa fonction et son adresse de courrier électronique (si nécessaire):"]
["Taper \"X\" dans la case appropriée:"]
[]
[]
["2. Le questionnaire est logiquement structuré et contient des instructions claires pour le compléter"]
{"$rows_left_out":52}
{"sheet":"(Hidden) Other SDG data","index":8,"n_rows":14,"n_cols":6,"rows_kept":14,"cut":false,"hidden":true,"merged":[[3,0,3,6],[6,0,8,0],[9,0,10,0],[11,0,13,0],[11,3,11,4],[12,3,12,4],[13,3,13,4]]}
[]
[]
[]
["OTHER SDG DATA"]
[]
["Source","Variable","Unit",2015,2016,2017]
["UNSD","Agriculture, value added to GDP","US$ current"]
[null,"Industry, value added to GDP (MIMEC)","US$ current"]
[null,"Services, value added to GDP","US$ current"]
["FAOSTAT","GDP Deflator (2015)","-"]
[null,"Cultivated land (Arable land + Permanent crop)","1000 ha"]
["AQUASTAT","Ratio between rainfed and irrigated yields","%"]
[null,"Total renewable freshwater resources","10^9 m3/yr"]
[null,"Environmental flow requirements (volume)","10^9 m3/yr"]