{"text_format":"1","workbook":"xlsx","n_sheets":9,"sheets":["Portada","Instrucciones","Definiciones","Datos nacionales","Metadatos","ODS 6.4.1","ODS 6.4.2","Feedback","(Hidden) Other SDG data"],"not_rendered":{"charts":0,"images":2,"macros":1,"external_links":0,"defined_names":8,"comments":0,"pivot_tables":0},"unopened":[],"bounds":{"document_bytes":16777216,"sheet_cells":100000,"rows_first":2000,"rows_last":500,"rows_between":2000,"halvings":0,"cell_chars":16384,"cell_head_chars":4096},"cells_cut":0,"cells_raw":0,"read":"whole","date_system":"1900"}

{"sheet":"Portada","index":0,"n_rows":48,"n_cols":1,"rows_kept":48,"cut":false,"hidden":false,"merged":[[3,0,3,8],[4,0,4,8],[38,0,38,8],[36,0,36,8],[14,0,14,8],[15,2,15,8],[16,2,16,8],[16,0,16,1],[15,0,15,1],[17,0,17,1],[17,2,17,8],[18,0,18,1],[18,2,18,8],[19,0,19,1],[19,2,19,8],[20,0,20,1],[23,0,23,1],[23,2,23,8],[10,0,10,8],[6,0,6,8],[9,0,9,8],[12,0,12,8],[20,2,20,8],[21,0,21,1],[21,2,21,8],[22,0,22,1],[22,2,22,8],[7,0,7,8],[44,0,44,8],[45,0,45,8],[46,0,46,8],[47,0,47,8],[37,0,37,8],[41,0,41,8],[40,0,40,8],[39,0,39,8],[25,0,25,8],[26,0,26,1],[26,2,26,8],[27,0,27,1],[27,2,27,8],[32,0,32,1],[32,2,32,8],[33,0,33,1],[33,2,33,8],[34,0,34,1],[34,2,34,8],[31,0,31,1],[31,2,31,8],[28,0,28,1],[28,2,28,8],[29,0,29,1],[29,2,29,8],[30,0,30,1],[30,2,30,8]]}
[]
[]
[]
["Cuestionario Agua y Agricultura 2019"]
[" Recopilación AQUASTAT de datos sobre el uso del agua para la agricultura y el desarrollo rural"]
[]
["País: "]
["Referencia: años civiles de 2015 a 2017"]
[]
["Finalidad del cuestionario"]
["Los datos recopilados a través de este cuestionario tienen como objetivo proporcionar una visión global de los recursos y usos del agua a nivel nacional y subnacional, y describir sus principales características, tendencias, limitaciones y perspectivas, prestando especial atención al sector agrícola. En particular, se espera que los datos recolectados:\n\n- Permitir la actualización de la base de datos AQUASTAT, que es el sistema mundial público de información de referencia sobre el agua que mantiene la FAO. Desde 1994, AQUASTAT proporciona información de calidad sobre los recursos hídricos y el uso del agua en cada país y la pone a disposición de los usuarios en un formato estándar. Se centra en los países en desarrollo de África, Asia, América Latina y el Caribe. Los datos y los informes de AQUASTAT están disponibles en http://www.fao.org/aquastat.\n\n- Monitorear los indicadores de los Objetivos de Desarrollo Sostenible (ODS) relacionados con el agua 6.4.1 (eficiencia del agua) y 6.4.2 (estrés hídrico), de los cuales la FAO es la agencia de custodia.\n\n- Apoyar los análisis sobre el agua en la agricultura y servir como una herramienta importante para la planificación a gran escala y los estudios predictivos.\n\n- Proporcionar a los responsables de las políticas información completa sobre el estado de la gestión del agua en los países en la agricultura en todo el mundo."]
[]
["Sírvase facilitar o actualizar la información de contacto del coordinador nacional responsible de las estadísticas sobre agua y regio de su país."]
[]
["Corresponsal Nacional AQUASTAT"]
["Nombre"]
["Cargo"]
["Administración"]
["Dirección"]
["Ciudad"]
{"$rows_left_out":29}
{"sheet":"Instrucciones","index":1,"n_rows":66,"n_cols":3,"rows_kept":66,"cut":false,"hidden":false,"merged":[[3,0,3,9],[7,0,7,9],[12,0,12,1],[18,0,18,1],[20,0,20,1],[14,0,14,1],[16,0,16,1],[5,0,5,9],[10,0,10,1],[14,2,14,9],[16,2,16,9],[10,2,10,9],[8,0,8,1],[8,2,8,9],[12,2,12,9],[61,10,61,11],[59,0,59,1],[60,0,60,1],[58,2,58,9],[59,2,59,9],[60,2,60,9],[58,0,58,1],[57,0,57,8],[18,2,18,9],[20,2,20,9],[62,0,62,1],[65,0,65,1],[65,2,65,9],[62,2,62,9],[61,0,61,1],[61,2,61,9],[63,0,63,1],[63,2,63,9],[64,0,64,1],[64,2,64,9]]}
[]
[]
[]
["INSTRUCCIONES"]
[]
["Se ruega a los usuarios que lean estas instrucciones antes de comenzar a completar el cuestionario"]
[]
["Instrucciones generales"]
["Coherencia de datos",null,"Antes de enviar el cuestionario, asegúrese de la coherencia y uniformidad mediante verificación cruzada entre variables. La suma de las áreas equipadas para el riego a nivel subnacional, por ejemplo, debe agregarse a la superficie total equipada para el riego a nivel nacional. Preste especial atención al doble conteo."]
[]
["Version electrónic",null,"Este cuestionario se proporciona en formato .xlsx. La opción preferida es completarlo en esta versión electrónica y devolverlpa por correo electrónico.\nTenga en cuenta que la estructura del cuestionario es tal que, una vez verificado, puede introducirse automáticamente en la base de datos informatizada. Para poder hacer esto, es importante que el coordinador oficial use el cuestionario tal como está y no cambie la estructura del mismo ni copie las diferentes hojas de trabajo en otros archivos."]
[]
["Nomenclatura Internacional",null,"This questionnaire is aligned with the System of Environmental-Economic Accounting for Water (SEEA-Water) (https://unstats.un.org/unsd/envaccounting/seeaw/) and also uses some definitions of the World Census of Agriculture 2020, Volume 1 (WCA) (http://www.fao.org/world-census-agriculture). E presente cuestionario está alineado por el Sistema de Cuentas Económico-Ambientales del Agua (SCEE-Agua) (https://unstats.un.org/unsd/envaccounting/seeaw/) y también utiliza algunas definiciones del Censo Mundial de Agricultura 2020, Volumen 1 (WCA) (http://www.fao.org/world-census-agriculture)."]
[]
["Año civil",null,"Sírvase facilitar los datos según el año civil (1 de Enero al 31 de Dicembre) indicafo el la parte superior de la columna."]
[]
["Unidades",null,"Los datos deben expresarse en Hectares (ha) o en m3. Los factores de conversión para algunas unidades de medida se informan al final de esta hoja.\nSi el valor consiste en decimales, use punto y no coma, por ejemplo, 0.0001 y NO 0,0001.\n"]
[]
["Signos convencionales",null,"Por favor reportar:\n    0    (cero) para el cero absoluto, cero redondeado o categorías no existentes, pero potencialmente aplicable\n    C    para datos que no pueden ser informados debido a problemas de confidencialidad\nNA    para datos faltantes (es decir, datos que existen pero no se informan por varias razones, excluyendo la confidencialidad para la cual se debe usar \"C\")\n     :    para no aplicable, los datos no pueden existir en su país."]
[]
{"$rows_left_out":47}
{"sheet":"Definiciones","index":2,"n_rows":111,"n_cols":2,"rows_kept":111,"cut":false,"hidden":false,"merged":[[36,1,36,9],[63,1,63,9],[41,1,41,9],[46,1,46,9],[48,1,48,9],[44,1,44,9],[0,0,2,9],[80,1,80,9],[100,1,100,9],[94,1,94,9],[74,1,74,9],[61,1,61,9],[18,1,18,9],[27,1,27,9],[7,0,7,9],[11,1,11,9],[57,1,57,9],[78,1,78,9],[65,1,65,9],[70,0,70,9],[71,0,71,9],[76,1,76,9],[15,0,15,9],[4,0,4,10],[103,0,103,9],[105,1,105,9],[108,0,108,9],[22,1,22,9],[20,1,20,9],[24,1,24,9],[92,1,92,9],[90,1,90,9],[96,1,96,9],[42,1,42,9],[25,1,25,9],[34,1,34,9],[29,1,29,9],[32,1,32,9],[110,1,110,9],[51,1,51,9],[53,1,53,9],[38,1,38,9],[55,1,55,9],[84,1,84,9],[86,1,86,9],[88,1,88,9],[82,1,82,9],[69,0,69,9],[95,1,95,9]]}
[]
[]
[]
[]
["DEFINICIONES"]
[]
["I. II. Recursos hídricos"]
["Los datos de AQUASTAT sobre los recursos hídricos se refieren a promedios anuales nacionales a largo plazo de los recursos hídricos renovables. Se puede encontrar más información sobre los recursos hídricos y las definiciones en la página de recursos hídricos de AQUASTAT en http://www.fao.org/aquastat/es/overview/methodology/water-resources.\nLas definiciones de los recursos hídricos en esta sección siguen las unidades estadísticas del medio ambiente y los elementos de datos físicos para los flujos hacia y desde el territorio de los Estándares Internacionales de Recursos Hídricos."]
[]
["0.1. Presas"]
["011","Recursos hídricos renovables totales (109=10^9 m3/año)"]
[null,"Total de los recursos hídricos renovables: es la suma de los recursos hídricos renovables internos y los recursos hídricos renovables externos. Corresponde a la cantidad máxima teórica de agua disponible cada año para un país en un momento determinado."]
[]
[]
["I. III. Extracción de agua y uso de agua"]
["Las extracciones de agua representan la cantidad bruta de agua utilizada para un determinado uso, pudiendo tratarse de agua superficial y subterránea. Incluye las pérdidas de agua en la distribución, los usos consuntivos y los flujos de retorno. No incluye el agua reservada para usos con niveles consuntivos bajos, como por ejemplo la navegación, la recreación, la minería, el enfriamiento en las centrales eléctricas, etc. "]
[]
["I.1. Extracciones de agua por sector"]
[null,"Las definiciones de los sectores siguen la codificación de la ISIC 4:\n1. \"Agricultura\" incluye agricultura, silvicultura y pesca (ISIC A);\n2. \"Industria\" incluye minas y canteras, fabricación, construcciones y energía (ISIC B, C, D y F);\n3. \"Municipal\" incluye los sectores de servicios (ISIC 36-39 y ISIC45-99), así como la industria de recolección, tratamiento y suministro de agua (ISIC 36)."]
[111,"Extracción total de agua (109=10^9 m3/año)"]
{"$rows_left_out":92}
{"sheet":"Datos nacionales","index":3,"n_rows":62,"n_cols":9,"rows_kept":62,"cut":false,"hidden":false,"merged":[[42,4,53,4],[36,4,38,4],[0,1,2,8],[10,1,10,8],[9,1,9,8],[5,1,5,8],[3,1,3,8],[28,4,33,4],[7,1,7,8],[18,4,26,4],[26,5,26,6],[14,5,14,6]]}
[]
[]
[]
[null,"DATOS NACIONALES"]
[]
[null,"Proporcione los valores nacionales de las siguientes variables en la unidad especificada para 2015, 2016 y 2017. Tenga cuidado ya que el año al cual se refieren los datos puede ser diferente del año de publicación."]
[null,"Si el valor consiste en decimales, use punto y no coma, por ejemplo, 0.0001 y NO 0,0001."]
[null,"Por favor reportar:\n    0    (cero) para el cero absoluto, cero redondeado o categorías no existentes, pero potencialmente aplicable\n    C    para datos que no pueden ser informados debido a problemas de confidencialidad\nNA    para datos faltantes (es decir, datos que existen pero no se informan por varias razones, excluyendo la confidencialidad para la cual se debe usar \"C\")\n     :    para no aplicable, los datos no pueden existir en su país."]
[null,"La definición de variables se proporciona en la hoja anterior \"Definiciones\", mientras que las conversiones de unidades se detallan en la hoja \"Instrucciones\"."]
[null,"Para cada valor, proporcione los metadatos correspondientes haciendo clic en el enlace en la columna Metadatos: lo dirigirá a la sección de la variable correspondiente en la hoja \"Metadatos\"."]
[null,"Si un valor insertado aparece en rojo, compruebe el valor y haga verificación cruzada entre las variables para evitar errores (por ejemplo, doble conteo, suma no igual a la suma de componentes o valor superior a uno de sus componentes)."]
[]
["I",0,null,"Recursos Hídricos"]
[null,"0.1. ",null,null,"Unidad",2015,2016,2017,"Metadatos"]
[4197,"011",4197,"Recursos hídricos renovables totales (promedio annual a largo plazo)","10^9 m3/año",null,null,null,"Clic para agregar metadatos en 011"]
[]
[null,"I",null,"Extracciones de agua"]
["II.1","I.1. ",null,"Extracciones de agua por sector","Unidad",2015,2016,2017,"Metadatos"]
[4253,111,4253,"Extracción total de agua (1111 + 1112 + 1113)","10^9 m3/año",null,null,null,"Clic para agregar metadatos en 111"]
[4250,1111,4250,"    Extracción de agua agrícola: total (11111 + 11112 + 11113)",null,null,null,null,"Clic para agregar metadatos en 1111"]
{"$rows_left_out":43}
{"sheet":"Metadatos","index":4,"n_rows":258,"n_cols":4,"rows_kept":258,"cut":false,"hidden":false,"merged":[[155,1,156,1],[241,0,243,0],[241,2,241,3],[242,2,242,3],[243,2,243,3],[245,2,245,3],[246,0,247,0],[246,1,247,1],[246,2,246,3],[247,2,247,3],[231,2,231,3],[232,0,233,0],[232,1,233,1],[232,2,232,3],[233,2,233,3],[234,0,236,0],[234,2,234,3],[235,2,235,3],[236,2,236,3],[210,2,210,3],[211,0,212,0],[211,1,212,1],[220,0,222,0],[220,2,220,3],[221,2,221,3],[222,2,222,3],[161,2,161,3],[162,0,163,0],[162,1,163,1],[162,2,162,3],[163,2,163,3],[164,0,166,0],[164,2,164,3],[165,2,165,3],[217,2,217,3],[218,0,219,0],[218,1,219,1],[218,2,218,3],[219,2,219,3],[175,2,175,3],[176,0,177,0],[176,1,177,1],[176,2,176,3],[177,2,177,3],[178,0,180,0],[178,2,178,3],[179,2,179,3],[180,2,180,3],[141,0,142,0],[141,1,142,1],[141,2,141,3],[142,2,142,3],[143,0,145,0],[143,2,143,3],[144,2,144,3],[145,2,145,3],[147,2,147,3],[140,2,140,3],[129,0,131,0],[129,2,129,3],[130,2,130,3],[131,2,131,3],[133,2,133,3],[134,0,135,0],[134,1,135,1],[134,2,134,3],[135,2,135,3],[136,0,138,0],[136,2,136,3],[137,2,137,3],[138,2,138,3],[91,2,91,3],[92,0,93,0],[92,1,93,1],[115,0,117,0],[115,2,115,3],[116,2,116,3],[117,2,117,3],[92,2,92,3],[93,2,93,3],[94,0,96,0],[94,2,94,3],[95,2,95,3],[96,2,96,3],[112,2,112,3],[113,0,114,0],[113,1,114,1],[113,2,113,3],[114,2,114,3],[98,2,98,3],[99,0,100,0],[99,1,100,1],[99,2,99,3],[100,2,100,3],[101,0,103,0],[66,0,68,0],[66,2,66,3],[67,2,67,3],[68,2,68,3],[3,0,3,3],[6,0,6,3],[7,0,7,3],[43,0,44,0],[45,0,47,0],[42,2,42,3],[43,2,43,3],[44,2,44,3],[45,2,45,3],[46,2,46,3],[47,2,47,3],[49,2,49,3],[5,0,5,3],[21,2,21,3],[22,0,23,0],[22,1,23,1],[22,2,22,3],[50,0,51,0],[50,1,51,1],[50,2,50,3],[77,2,77,3],[78,0,79,0],[78,1,79,1],[78,2,78,3],[79,2,79,3],[80,0,82,0],[80,2,80,3],[81,2,81,3],[82,2,82,3],[70,2,70,3],[71,0,72,0],[71,1,72,1],[71,2,71,3],[72,2,72,3],[73,0,75,0],[73,2,73,3],[74,2,74,3],[75,2,75,3],[84,2,84,3],[85,0,86,0],[85,1,86,1],[85,2,85,3],[86,2,86,3],[87,0,89,0],[87,2,87,3],[88,2,88,3],[89,2,89,3],[101,2,101,3],[102,2,102,3],[103,2,103,3],[105,2,105,3],[106,0,107,0],[106,1,107,1],[106,2,106,3],[124,2,124,3],[126,2,126,3],[127,0,128,0],[127,1,128,1],[127,2,127,3],[128,2,128,3],[107,2,107,3],[108,0,110,0],[108,2,108,3],[109,2,109,3],[110,2,110,3],[119,2,119,3],[120,0,121,0],[120,1,121,1],[120,2,120,3],[121,2,121,3],[122,0,124,0],[122,2,122,3],[123,2,123,3],[148,2,148,3],[149,2,149,3],[150,0,152,0],[150,2,150,3],[151,2,151,3],[152,2,152,3],[189,2,189,3],[190,0,191,0],[190,1,191,1],[190,2,190,3],[191,2,191,3],[148,0,149,0],[148,1,149,1],[182,2,182,3],[183,0,184,0],[183,1,184,1],[183,2,183,3],[184,2,184,3],[185,0,187,0],[185,2,185,3],[186,2,186,3],[187,2,187,3],[154,2,154,3],[155,0,156,0],[201,2,201,3],[203,2,203,3],[204,0,205,0],[204,1,205,1],[204,2,204,3],[205,2,205,3],[206,0,208,0],[206,2,206,3],[207,2,207,3],[208,2,208,3],[169,2,169,3],[170,2,170,3],[171,0,173,0],[171,2,171,3],[172,2,172,3],[173,2,173,3],[211,2,211,3],[212,2,212,3],[213,0,215,0],[213,2,213,3],[214,2,214,3],[215,2,215,3],[192,0,194,0],[192,2,192,3],[193,2,193,3],[194,2,194,3],[196,2,196,3],[197,0,198,0],[197,1,198,1],[197,2,197,3],[198,2,198,3],[199,0,201,0],[199,2,199,3],[200,2,200,3],[155,2,155,3],[156,2,156,3],[157,0,159,0],[157,2,157,3],[158,2,158,3],[159,2,159,3],[238,2,238,3],[239,0,240,0],[239,1,240,1],[239,2,239,3],[240,2,240,3],[224,2,224,3],[225,0,226,0],[225,1,226,1],[225,2,225,3],[226,2,226,3],[227,0,229,0],[227,2,227,3],[228,2,228,3],[229,2,229,3],[166,2,166,3],[168,2,168,3],[169,0,170,0],[169,1,170,1],[249,2,249,3],[250,2,250,3],[252,2,252,3],[253,0,254,0],[253,1,254,1],[253,2,253,3],[254,2,254,3],[255,0,257,0],[255,2,255,3],[256,2,256,3],[257,2,257,3],[248,0,250,0],[248,2,248,3],[23,2,23,3],[24,0,26,0],[24,2,24,3],[25,2,25,3],[26,2,26,3],[35,2,35,3],[36,0,37,0],[36,1,37,1],[36,2,36,3],[37,2,37,3],[28,2,28,3],[29,0,30,0],[29,1,30,1],[29,2,29,3],[30,2,30,3],[31,0,33,0],[31,2,31,3],[32,2,32,3],[33,2,33,3],[38,0,40,0],[38,2,38,3],[39,2,39,3],[40,2,40,3],[63,2,63,3],[64,0,65,0],[64,1,65,1],[64,2,64,3],[65,2,65,3],[60,2,60,3],[61,2,61,3],[51,2,51,3],[52,0,54,0],[52,2,52,3],[53,2,53,3],[54,2,54,3],[56,2,56,3],[57,0,58,0],[57,1,58,1],[57,2,57,3],[58,2,58,3],[59,0,61,0],[59,2,59,3],[43,1,44,1],[10,2,10,3],[11,2,11,3],[12,2,12,3],[13,2,13,3],[14,2,14,3],[15,2,15,3],[16,2,16,3],[17,2,17,3],[18,2,18,3]]}
[]
[]
[]
["METADATOS"]
[]
["Esta sección recopila, para cada dato proporcionado, metadatos sobre la fuente, los medios de difusión y comentarios específicos."]
["Complete los tres tipos de información (origen de datos, difusión de datos y metadatos) para cada variable. Para cada tipo de información, primero seleccione una categoría del menú desplegable en las celdas azules (opciones enumeradas a continuación) y luego especifique cualquier información adicional / comentario en la columna \"Por favor especifique\" al lado."]
["Haga clic en \"Volver a los datos\" para regresar a la variable correspondiente en la hoja \"Datos nacionales\"."]
[]
["1. Fuente de datos"," 2. Difusión de datos","3. Metadatos"]
["1.1 Censo","2.1 Base de datos","3.1 Área de referencia: Cobertura geográfica, por ejemplo: \"Excluye isla X\" o \"Incluye solo ciudad X\""]
["1.2 Encuesta","2.2 Anuario","3.2 Periodo de referencia: Cobertura de tiempo, por ejemplo: \"Datos en realidad a partir de 2010 considerados todavía válidos\""]
["1.3 Datos / registros administrativos","2.3 Boletín estadístico","3.3 Comparación (geográfica): ruptura de la cobertura geográfica, por ejemplo: \"Los datos excluyen la región X recién independizada\""]
["1.4 Estimaciones (especifique la metodología)","2.4 Otra publicación estadística","3.4 Comparación (en el tiempo): ruptura en series de tiempo, por ejemplo: \"El riego en invernaderos está incluido a partir de 2005\""]
["1.5 Desconocido","2.5 Informe de política","3.5 Ajuste: cambio comparado con la fuente de datos / diseminación, por ejemplo: \"Área dada en acres en fuente, convertida en ha con la relación acre = x * n ha\""]
[null,"2.6 Artículo académico","3.6 Precisión global: cualquier problema de calidad conocido con respecto a los datos, por ejemplo: \"La extracción municipal de agua del país se triplicó en cinco años\""]
[null,null,"3.7. Componentes: Cualquier otro detalle / desagregación disponible, por ejemplo: \"El caudal de los ríos fronterizos es 10, que consta de 5 del río A, 3 del río B y 2 del río C\"."]
[null,null,"3.8. Observaciones: notas contextuales generales sobre la variable en el país, por ejemplo: \"País sin litoral, sin desalinización posible\""]
[null,null,"3.9. Metodología: si el método por el cual se deriva un valor es conocido pero no encaja en ninguna de las categorías anteriores"]
[]
{"$rows_left_out":239}
{"sheet":"ODS 6.4.1","index":5,"n_rows":66,"n_cols":11,"rows_kept":66,"cut":false,"hidden":false,"merged":[[3,0,3,9],[5,1,5,9],[59,3,61,3],[62,3,63,3]]}
[]
[]
[]
["CÁLCULOS DEL INDICADOR 6.4.1 SOBRE LA EFICIENCIA DEL USO DEL AGUA (en $EE.UU/m3)"]
[null,null,null,null,null,null,null,null,null,null," "]
[null,"Esta hoja de trabajo es una herramienta para calcular automáticamente el indicador ODS 6.4.1 sobre la eficiencia del uso del agua. Por favor, no toque: no se requiere compilación. Se completa automáticamente con los datos que proporcionó en la hoja de trabajo \"Datos nacionales\" y algunos datos adicionales (consulte la tabla a continuación). Si el indicador no se calcula, faltan demasiadas variables: verifique si puede completar más variables en la hoja de trabajo \"Datos nacionales\". Las celdas azules se calculan gracias a las celdas grises rellenadas automáticamente."]
[]
[null,null,null,null,null,null,null,null,"Año: ",{"$f":"LOOKUP(2,1/('Datos nacionales'!F20:H20),'Datos nacionales'!F18:H18)","v":{"$error":"#N/A"}}]
[]
[null,"EFICIENCIA DEL USO DEL AGUA EN LA AGRICULTURA DE RIEGO (Awe)",null,null,null,null,null,"UNIDAD","REGLAS DE CÁLCULO"]
[]
[null,null,"Coeficiente entre los rendimientos de los cultivos de secano y los cultivos de regadío",null,null,"[1]",{"$f":"I65","v":0},"decimales","Data AQUASTAT (abajo) utilizada si no entrada"]
[]
[null,null,"Porcentaje de tierras de regadío sobre el total de tierras cultivables (Ai)",null,null,"[2]",{"$f":"IF(OR(G15=\"\",G15=0), 0, (G15/G16))","v":{"$error":"#N/A"}},"decimales","=[3]/[4]"]
[null,null,null,"Tierras de regadío",null,"[3]",{"$f":"LOOKUP(2,1/(ISNUMBER('Datos nacionales'!F56:H56)),'Datos nacionales'!F56:H56)","v":{"$error":"#N/A"}},"1000 ha"]
[null,null,null,"Tierras cultivables",null,"[4]",{"$f":"INDEX(G64:I64, MATCH(LOOKUP(2,1/('Datos nacionales'!F56:H56),'Datos nacionales'!F18:H18),G59:I59,0))","v":{"$error":"#N/A"}},"1000 ha"]
[]
[null,null,"Porcentaje de GVA agrícola producido por la agricultura de secano (Cr)",null,null,"[5]",{"$f":"IF(G14=1,0,(IF(G12=\"\",(1/(1+(G14/((1-G14)*0.562)))),IF(G12=0,0,(1/(1+(G14/((1-G14)*G12))))))))","v":{"$error":"#N/A"}},"decimales","=(1/(1+([2]/((1-[2])*[1])))))"]
[]
[null,null,"Valor añadido bruto de la agricultura ",null,null,"[7]",{"$f":"INDEX(G60:I60,MATCH(LOOKUP(2,1/('Datos nacionales'!F20:H20),'Datos nacionales'!F18:H18),G59:I59,0))/INDEX(G63:I63,MATCH(LOOKUP(2,1/('Datos nacionales'!F20:H20),'Datos nacionales'!F18:H18),G59:I59,0))*100","v":{"$error":"#N/A"}},"$EE.UU (2015 precio)"]
{"$rows_left_out":47}
{"sheet":"ODS 6.4.2","index":6,"n_rows":32,"n_cols":11,"rows_kept":32,"cut":false,"hidden":false,"merged":[[29,2,29,3],[30,2,30,3],[3,0,3,9],[5,1,5,9],[11,8,11,9],[17,8,17,9],[19,8,19,9],[28,2,28,3]]}
[]
[]
[]
["CÁLCULOS DEL INDICADOR 6.4.2 SOBRE EL ESTRÉS HÍDRICO POR PAÍS (en %)"]
[]
[null,"Esta hoja de trabajo es una herramienta para calcular automáticamente el indicador ODS 6.4.1 sobre la eficiencia del uso del agua. Por favor, no toque: no se requiere compilación. Se completa automáticamente con los datos que proporcionó en la hoja de trabajo \"Datos nacionales\" y algunos datos adicionales (consulte la tabla a continuación). Si el indicador no se calcula, faltan demasiadas variables: verifique si puede completar más variables en la hoja de trabajo \"Datos nacionales\"."]
[]
[null,null,null,null,null,null,null,null,"Año: ",{"$f":"LOOKUP(2,1/('Datos nacionales'!F19:H19),'Datos nacionales'!F18:H18)","v":{"$error":"#N/A"}}," "]
[]
[null,"NIVEL DE ESTRÉS HÍDRICO",null,null,null,null,null,"UNIDAD",null,"REGLAS DE CÁLCULO"]
[]
[null,null,"Extracción total de agua dulce (superficial + subterránea)",null,null,"[1]",{"$f":"IF(AND('Datos nacionales'!F29=\"\",'Datos nacionales'!G29=\"\",'Datos nacionales'!H29=\"\"), SUM(G13-G14-G15-G16), LOOKUP(2,1/(ISNUMBER('Datos nacionales'!F29:H29)),'Datos nacionales'!F29:H29))","v":{"$error":"#N/A"}},"in 10^9 m3","=[2]-[3]-[4]-[5] si falta de \"Datos Nacionales\" "]
[null,null,null,"Extracción total de agua",null,"[2]",{"$f":"LOOKUP(2,1/(ISNUMBER('Datos nacionales'!F19:H19)),'Datos nacionales'!F19:H19)","v":{"$error":"#N/A"}},"in 10^9 m3",{"$f":"IF(G13=('ODS 6.4.1'!G23+'ODS 6.4.1'!G32+'ODS 6.4.1'!G40),\"OK\",\"ERROR\")","v":{"$error":"#N/A"}}]
[null,null,null,"Agua desalinizada producida",null,"[3]",{"$f":"LOOKUP(2,1/(ISNUMBER('Datos nacionales'!F32:H32)),'Datos nacionales'!F32:H32)","v":{"$error":"#N/A"}},"in 10^9 m3"]
[null,null,null,"Uso directo de aguas residuales municipal tratada",null,"[4]",{"$f":"LOOKUP(2,1/(ISNUMBER('Datos nacionales'!F33:H33)),'Datos nacionales'!F33:H33)","v":{"$error":"#N/A"}},"in 10^9 m3"]
[null,null,null,"Uso directo agua de drenaje agrícola",null,"[5]",{"$f":"LOOKUP(2,1/(ISNUMBER('Datos nacionales'!F34:H34)),'Datos nacionales'!F34:H34)","v":{"$error":"#N/A"}},"in 10^9 m3"]
[]
[null,null,"Recursos hídricos renovables totales",null,null,"[6]",{"$f":"IF('Datos nacionales'!H15=\"\", I30, 'Datos nacionales'!H15)","v":0},"in 10^9 m3","Data AQUASTAT (abajo) utilizada si no entrada"]
[]
[null,null,"Requisitos de caudales ambientales (volumen)",null,null,"[7]",{"$f":"IF('Datos nacionales'!H27=\"\",I31, 'Datos nacionales'!H27)","v":0},"in 10^9 m3","Data FAO-IMWI (abajo) utilizada si no entrada"]
{"$rows_left_out":13}
{"sheet":"Feedback","index":7,"n_rows":66,"n_cols":9,"rows_kept":66,"cut":false,"hidden":false,"merged":[[3,0,3,13],[5,0,5,13],[25,8,25,12],[32,0,32,1],[32,8,32,12],[25,0,25,1],[10,8,10,13],[67,1,67,8],[11,0,11,1],[11,8,11,12],[18,0,18,1],[18,8,18,12],[39,0,39,1],[39,8,39,12],[46,8,46,12],[51,1,51,8],[55,1,55,8],[59,1,59,8],[63,1,63,8],[46,0,46,1]]}
[]
[]
[]
["FEEDBACK"]
[]
["La metodología utilizada en este cuestionario se revisa periódicamente para mejorar su eficiencia, reducir la carga de trabajo e identificar áreas de mejora. Los comentarios de los oficiales informantes son particularmente apreciados y alentados.\nEn caso de que más de una persona haya contribuido a la compilación del cuestionario, el coordinador (indicado en la portada) debe completar esta hoja de trabajo recopilando esta información de todos los contribuyentes."]
[]
["1. Se envió el cuestionario directamente a la persona correcta"]
[]
[]
[null,null,"Muy de acuerdo","De acuerdo","Acuerdo parcial","En desacuerdo","Muy de desacuerdo",null,"Sírvase especificar el nombre, cargo y correo electrónico de la persona correcta (en caso necesario):"]
["Sírvase marcar on  una \"X\" la casilla correspondiente:"]
[]
[]
["2. El cuestionario tiene una estructura lógica y contiene instrucciones claras para su cumplimentación"]
[]
[]
[null,null,"Muy de acuerdo","De acuerdo","Acuerdo parcial","En desacuerdo","Muy de desacuerdo",null,"Sírvase especificar:"]
["Sírvase marcar on  una \"X\" la casilla correspondiente:"]
[]
{"$rows_left_out":47}
{"sheet":"(Hidden) Other SDG data","index":8,"n_rows":14,"n_cols":6,"rows_kept":14,"cut":false,"hidden":true,"merged":[[3,0,3,6],[6,0,8,0],[9,0,10,0],[11,0,13,0],[11,3,11,4],[12,3,12,4],[13,3,13,4]]}
[]
[]
[]
["OTHER SDG DATA"]
[]
["Source","Variable","Unit",2015,2016,2017]
["UNSD","Agriculture, value added to GDP","US$ current"]
[null,"Industry, value added to GDP (MIMEC)","US$ current"]
[null,"Services, value added to GDP","US$ current"]
["FAOSTAT","GDP Deflator (2015)","-"]
[null,"Cultivated land (Arable land + Permanent crop)","1000 ha"]
["AQUASTAT","Ratio between rainfed and irrigated yields","%"]
[null,"Total renewable freshwater resources","10^9 m3/yr"]
[null,"Environmental flow requirements (volume)","10^9 m3/yr"]