{"text_format":"1","workbook":"xlsx","n_sheets":9,"sheets":["Cover","Instructions","Definitions","National data","Metadata","SDG 6.4.1","SDG 6.4.2","Feedback"," (Hidden) Other SDG data"],"not_rendered":{"charts":0,"images":6,"macros":1,"external_links":0,"defined_names":8,"comments":0,"pivot_tables":0},"unopened":[],"bounds":{"document_bytes":16777216,"sheet_cells":100000,"rows_first":2000,"rows_last":500,"rows_between":2000,"halvings":0,"cell_chars":16384,"cell_head_chars":4096},"cells_cut":0,"cells_raw":0,"read":"whole","date_system":"1900"}

{"sheet":"Cover","index":0,"n_rows":48,"n_cols":5,"rows_kept":48,"cut":false,"hidden":false,"merged":[[3,0,3,8],[4,0,4,8],[38,0,38,8],[36,0,36,8],[14,0,14,8],[15,2,15,8],[16,2,16,8],[16,0,16,1],[15,0,15,1],[17,0,17,1],[17,2,17,8],[18,0,18,1],[18,2,18,8],[19,0,19,1],[19,2,19,8],[20,0,20,1],[23,0,23,1],[23,2,23,8],[10,0,10,8],[9,0,9,8],[12,0,12,8],[20,2,20,8],[21,0,21,1],[21,2,21,8],[22,0,22,1],[22,2,22,8],[6,0,6,4],[6,5,6,8],[44,0,44,8],[45,0,45,8],[46,0,46,8],[25,0,25,8],[26,0,26,1],[26,2,26,8],[27,0,27,1],[27,2,27,8],[32,0,32,1],[32,2,32,8],[33,0,33,1],[33,2,33,8],[34,0,34,1],[34,2,34,8],[47,0,47,8],[37,0,37,8],[41,0,41,8],[40,0,40,8],[39,0,39,8],[31,0,31,1],[31,2,31,8],[28,0,28,1],[28,2,28,8],[29,0,29,1],[29,2,29,8],[30,0,30,1],[30,2,30,8]]}
[]
[]
[]
["Water and Agriculture Questionnaire 2019"]
["AQUASTAT Data collection on water use for agriculture and rural development"]
[]
["Country: "]
[null,null,null,null,"Reference: calendar years from 2015 to 2017"]
[]
["Purpose of the questionnaire"]
["Data collected through this questionnaire aim to provide a comprehensive picture of water resources and uses at the national level, and to describe its major characteristics, trends, constraints and perspectives, with particular attention to the agricultural sector. In particular, data collected are expected to:\n\n- Allow the update the AQUASTAT database, which is the global public reference information system on water maintained by the FAO. Since 1994, AQUASTAT provides quality information on water resources and water use in each country and makes it available to the users in a standard format. It focuses on developing countries in Africa, Asia, Latin America and the Caribbean. AQUASTAT data and reports are available on at http://www.fao.org/aquastat. \n\n- Monitor the water-related Sustainable Development Goals' (SDG) indicators 6.4.1 (water efficiency) and 6.4.2 (water stress), of which FAO is the custodian agency. \n\n- Support the analyses on water in agriculture and serve as a major tool for large-scale planning and predictive studies.\n\n- Provide policy makers with comprehensive information on the state of country water management in agriculture across the world.\n"]
[]
["Please complete or update the contact details of the national focal point responsible for this questionnaire in your country. "]
[]
["AQUASTAT National Correspondent"]
["Name"]
["Title"]
["Organization"]
["Address"]
["City"]
{"$rows_left_out":29}
{"sheet":"Instructions","index":1,"n_rows":66,"n_cols":3,"rows_kept":66,"cut":false,"hidden":false,"merged":[[3,0,3,9],[7,0,7,9],[12,0,12,1],[18,0,18,1],[20,0,20,1],[14,0,14,1],[16,0,16,1],[5,0,5,9],[10,0,10,1],[14,2,14,9],[16,2,16,9],[10,2,10,9],[8,0,8,1],[8,2,8,9],[12,2,12,9],[61,10,61,11],[59,0,59,1],[60,0,60,1],[58,2,58,9],[59,2,59,9],[60,2,60,9],[58,0,58,1],[57,0,57,8],[18,2,18,9],[20,2,20,9],[62,0,62,1],[65,0,65,1],[65,2,65,9],[62,2,62,9],[61,0,61,1],[61,2,61,9],[63,0,63,1],[63,2,63,9],[64,0,64,1],[64,2,64,9]]}
[]
[]
[]
["INSTRUCTIONS"]
[]
["Users are kindly asked to read these instructions before starting filling in the questionnaire"]
[]
["General Instructions"]
["Data coherency",null,"Before submitting the questionnaire, please ensure coherency and consistency by cross-checking between variables. The sum of areas equipped for irrigation at sub-national level, for instance, must add up to the total area equipped for irrigation at national level. Please pay special attention to double counting."]
[]
["Electronic version",null,"This questionnaire is provided in .xlsx format. The preferred option is to have it completed in this electronic version and returned by email.\nPlease note that the structure of the questionnaire is such that, once verified, it can be introduced automatically in the computerized database. In order to be able to do this, it is important that the reporting officer uses the questionnaire as it is and does not change the structure of it nor copy the different worksheets into other files."]
[]
["International standards and classifications",null,"This questionnaire is aligned with the System of Environmental-Economic Accounting for Water (SEEA-Water) (https://unstats.un.org/unsd/envaccounting/seeaw/) and also uses some definitions of the World Census of Agriculture 2020, Volume 1 (WCA) (http://www.fao.org/world-census-agriculture)."]
[]
["Calendar year",null,"Kindly report your data with reference to the calendar year (1 January to 31 December) indicated on top of the column."]
[]
["Units",null,"Data are to be expressed in Hectares (ha) or in m3. Conversion factors for some units of measurement are reported at the end of this worksheet.\nIf the value consists of decimals use point and not comma, for example 0.0001 and NOT 0,0001.\n"]
[]
["Notation keys",null,"Please report:\n   0    (zero) for absolute zero, rounded zero or not occuring categories but potentially applicable\n   C    for data that cannot be reported due to confidentiality issues \nNA    for missing data (meaning data that exist but are not reported for several reasons, excluding confidentiality for which “C” should be used)\n    :    for non-applicable, data cannot exist in your country."]
[]
{"$rows_left_out":47}
{"sheet":"Definitions","index":2,"n_rows":111,"n_cols":2,"rows_kept":111,"cut":false,"hidden":false,"merged":[[92,1,92,9],[82,1,82,9],[110,1,110,9],[96,1,96,9],[42,1,42,9],[63,1,63,9],[95,1,95,9],[90,1,90,9],[70,0,70,9],[71,0,71,9],[76,1,76,9],[84,1,84,9],[86,1,86,9],[88,1,88,9],[103,0,103,9],[105,1,105,9],[69,0,69,9],[65,1,65,9],[25,1,25,9],[34,1,34,9],[29,1,29,9],[32,1,32,9],[36,1,36,9],[53,1,53,9],[38,1,38,9],[55,1,55,9],[48,1,48,9],[22,1,22,9],[20,1,20,9],[24,1,24,9],[41,1,41,9],[46,1,46,9],[44,1,44,9],[108,0,108,9],[0,0,2,9],[80,1,80,9],[100,1,100,9],[94,1,94,9],[74,1,74,9],[61,1,61,9],[4,0,4,9],[18,1,18,9],[27,1,27,9],[7,0,7,9],[11,1,11,9],[57,1,57,9],[78,1,78,9],[15,0,15,9],[51,1,51,9]]}
[]
[]
[]
[]
["DEFINITIONS"]
[]
["I. Water resources"]
["AQUASTAT data on water resources refers to national long-term annual averages of the renewable water resources. More information on water resources and definitions can also be found on the AQUASTAT water resources page at http://www.fao.org/aquastat/en/overview/methodology/water-resources.\nDefinitions of water resources in this section follows the statistical units of environment and the physical data items for flows into and out of the territory of the International Water Resources Standards."]
[]
["0.1. Water resources"]
["011","Total Renewable Water Resources (109=10^9 m3/year)"]
[null,"The sum of internal renewable water resources and external renewable water resources. It corresponds to the maximum theoretical yearly amount of water available for a country at a given moment."]
[]
[]
["I. Water withdrawal and use"]
["Water withdrawal refers to the gross amount of water for a given use, either surface water or groundwater. It includes conveyance losses, consumptive use and return flow. It does not include water to be reserved for uses with a low consumption rate, such as for example hydropower, navigation or recreation."]
[]
["I.1. Water withdrawal by sector"]
[null,"Definitions of sectors follow the ISIC 4 coding:\n1. “Agriculture” includes agriculture, forestry and fishing (ISIC A);\n2. “Industry” includes mining and quarrying, manufacturing, constructions and energy (ISIC B, C, D and F);\n3. “Municipal” includes service sectors (ISIC 36-39 and ISIC 45-99), as well as water collection, treatment and supply industry (ISIC 36)."]
[111,"Total water withdrawal (109=10^9m³/year)"]
{"$rows_left_out":92}
{"sheet":"National data","index":3,"n_rows":62,"n_cols":9,"rows_kept":62,"cut":false,"hidden":false,"merged":[[42,4,53,4],[36,4,38,4],[0,1,2,8],[10,1,10,8],[9,1,9,8],[5,1,5,8],[3,1,3,8],[28,4,33,4],[7,1,7,8],[14,5,14,6],[26,5,26,6],[18,4,26,4]]}
[]
[]
[]
[null,"NATIONAL DATA"]
[]
[null,"Please provide the national values for the following variables in the specified unit for 2015, 2016 and 2017. Please be careful as the year the data refers to, can be different from the year of publication."]
[null,"If the value contains a decimal point, use the point symbol and not a comma, e.g. 0.0001."]
[null,"Please report:\n   0    (zero) for absolute zero, rounded zero or non-relevant categories \n   C    for data that cannot be reported due to confidentiality issues \nNA    for missing data (meaning data that exist but are not reported for several reasons, excluding confidentiality for which “C” should be used)\n    :    for non-applicable, data cannot exist "]
[null,"Definition of variables are provided in the previous worksheet \"Definitions\", while unit conversions are detailed in the worksheet \"Instructions\"."]
[null,"For each value, please provide the corresponding metadata by clicking on the link in the Metadata column: it will direct you to the section for the corresponding variable in the worksheet \"Metadata\"."]
[null,"If an inserted value appears in red please check the value and cross-check between the variables to avoid errors (e.g. double counting, addition not equals to sum of components, or value higher than one of its components)."]
[]
["I",0,null,"Water Resources"]
[null,"0.1. ",null,null,"Unit",2015,2016,2017,"Metadata"]
[4197,"011",4197,"Total Renewable Water Resources (Long-term average)","10^9 m3/year",null,null,null,"Click to add metadata on 011"]
[]
[null,"I",null,"Water withdrawals"]
["II.1","I.1. ",null,"Water withdrawals by sector","Unit",2015,2016,2017,"Metadata"]
[4253,111,4253,"Total water withdrawal (1111 + 1112 + 1113)","10^9 m3/year",null,null,null,"Click to add metadata on 111"]
[4250,1111,4250,"     Agricultural water withdrawal: total (11111 + 11112 + 11113)",null,null,null,null,"Click to add metadata on 1111"]
{"$rows_left_out":43}
{"sheet":"Metadata","index":4,"n_rows":258,"n_cols":4,"rows_kept":258,"cut":false,"hidden":false,"merged":[[155,1,156,1],[241,0,243,0],[241,2,241,3],[242,2,242,3],[243,2,243,3],[245,2,245,3],[246,0,247,0],[246,1,247,1],[246,2,246,3],[247,2,247,3],[231,2,231,3],[232,0,233,0],[232,1,233,1],[232,2,232,3],[233,2,233,3],[234,0,236,0],[234,2,234,3],[235,2,235,3],[236,2,236,3],[210,2,210,3],[211,0,212,0],[211,1,212,1],[220,0,222,0],[220,2,220,3],[221,2,221,3],[222,2,222,3],[161,2,161,3],[162,0,163,0],[162,1,163,1],[162,2,162,3],[163,2,163,3],[164,0,166,0],[164,2,164,3],[165,2,165,3],[217,2,217,3],[218,0,219,0],[218,1,219,1],[218,2,218,3],[219,2,219,3],[175,2,175,3],[176,0,177,0],[176,1,177,1],[176,2,176,3],[177,2,177,3],[178,0,180,0],[178,2,178,3],[179,2,179,3],[180,2,180,3],[141,0,142,0],[141,1,142,1],[141,2,141,3],[142,2,142,3],[143,0,145,0],[143,2,143,3],[144,2,144,3],[145,2,145,3],[147,2,147,3],[140,2,140,3],[129,0,131,0],[129,2,129,3],[130,2,130,3],[131,2,131,3],[133,2,133,3],[134,0,135,0],[134,1,135,1],[134,2,134,3],[135,2,135,3],[136,0,138,0],[136,2,136,3],[137,2,137,3],[138,2,138,3],[91,2,91,3],[92,0,93,0],[92,1,93,1],[115,0,117,0],[115,2,115,3],[116,2,116,3],[117,2,117,3],[92,2,92,3],[93,2,93,3],[94,0,96,0],[94,2,94,3],[95,2,95,3],[96,2,96,3],[112,2,112,3],[113,0,114,0],[113,1,114,1],[113,2,113,3],[114,2,114,3],[98,2,98,3],[99,0,100,0],[99,1,100,1],[99,2,99,3],[100,2,100,3],[101,0,103,0],[66,0,68,0],[66,2,66,3],[67,2,67,3],[68,2,68,3],[3,0,3,3],[6,0,6,3],[7,0,7,3],[43,0,44,0],[45,0,47,0],[42,2,42,3],[43,2,43,3],[44,2,44,3],[45,2,45,3],[46,2,46,3],[47,2,47,3],[49,2,49,3],[5,0,5,3],[21,2,21,3],[22,0,23,0],[22,1,23,1],[22,2,22,3],[50,0,51,0],[50,1,51,1],[50,2,50,3],[77,2,77,3],[78,0,79,0],[78,1,79,1],[78,2,78,3],[79,2,79,3],[80,0,82,0],[80,2,80,3],[81,2,81,3],[82,2,82,3],[70,2,70,3],[71,0,72,0],[71,1,72,1],[71,2,71,3],[72,2,72,3],[73,0,75,0],[73,2,73,3],[74,2,74,3],[75,2,75,3],[84,2,84,3],[85,0,86,0],[85,1,86,1],[85,2,85,3],[86,2,86,3],[87,0,89,0],[87,2,87,3],[88,2,88,3],[89,2,89,3],[101,2,101,3],[102,2,102,3],[103,2,103,3],[105,2,105,3],[106,0,107,0],[106,1,107,1],[106,2,106,3],[124,2,124,3],[126,2,126,3],[127,0,128,0],[127,1,128,1],[127,2,127,3],[128,2,128,3],[107,2,107,3],[108,0,110,0],[108,2,108,3],[109,2,109,3],[110,2,110,3],[119,2,119,3],[120,0,121,0],[120,1,121,1],[120,2,120,3],[121,2,121,3],[122,0,124,0],[122,2,122,3],[123,2,123,3],[148,2,148,3],[149,2,149,3],[150,0,152,0],[150,2,150,3],[151,2,151,3],[152,2,152,3],[189,2,189,3],[190,0,191,0],[190,1,191,1],[190,2,190,3],[191,2,191,3],[148,0,149,0],[148,1,149,1],[182,2,182,3],[183,0,184,0],[183,1,184,1],[183,2,183,3],[184,2,184,3],[185,0,187,0],[185,2,185,3],[186,2,186,3],[187,2,187,3],[154,2,154,3],[155,0,156,0],[201,2,201,3],[203,2,203,3],[204,0,205,0],[204,1,205,1],[204,2,204,3],[205,2,205,3],[206,0,208,0],[206,2,206,3],[207,2,207,3],[208,2,208,3],[169,2,169,3],[170,2,170,3],[171,0,173,0],[171,2,171,3],[172,2,172,3],[173,2,173,3],[211,2,211,3],[212,2,212,3],[213,0,215,0],[213,2,213,3],[214,2,214,3],[215,2,215,3],[192,0,194,0],[192,2,192,3],[193,2,193,3],[194,2,194,3],[196,2,196,3],[197,0,198,0],[197,1,198,1],[197,2,197,3],[198,2,198,3],[199,0,201,0],[199,2,199,3],[200,2,200,3],[155,2,155,3],[156,2,156,3],[157,0,159,0],[157,2,157,3],[158,2,158,3],[159,2,159,3],[238,2,238,3],[239,0,240,0],[239,1,240,1],[239,2,239,3],[240,2,240,3],[224,2,224,3],[225,0,226,0],[225,1,226,1],[225,2,225,3],[226,2,226,3],[227,0,229,0],[227,2,227,3],[228,2,228,3],[229,2,229,3],[166,2,166,3],[168,2,168,3],[169,0,170,0],[169,1,170,1],[249,2,249,3],[250,2,250,3],[252,2,252,3],[253,0,254,0],[253,1,254,1],[253,2,253,3],[254,2,254,3],[255,0,257,0],[255,2,255,3],[256,2,256,3],[257,2,257,3],[248,0,250,0],[248,2,248,3],[23,2,23,3],[24,0,26,0],[24,2,24,3],[25,2,25,3],[26,2,26,3],[35,2,35,3],[36,0,37,0],[36,1,37,1],[36,2,36,3],[37,2,37,3],[28,2,28,3],[29,0,30,0],[29,1,30,1],[29,2,29,3],[30,2,30,3],[31,0,33,0],[31,2,31,3],[32,2,32,3],[33,2,33,3],[38,0,40,0],[38,2,38,3],[39,2,39,3],[40,2,40,3],[63,2,63,3],[64,0,65,0],[64,1,65,1],[64,2,64,3],[65,2,65,3],[60,2,60,3],[61,2,61,3],[51,2,51,3],[52,0,54,0],[52,2,52,3],[53,2,53,3],[54,2,54,3],[56,2,56,3],[57,0,58,0],[57,1,58,1],[57,2,57,3],[58,2,58,3],[59,0,61,0],[59,2,59,3],[43,1,44,1],[10,2,10,3],[11,2,11,3],[12,2,12,3],[13,2,13,3],[14,2,14,3],[15,2,15,3],[16,2,16,3],[17,2,17,3],[18,2,18,3]]}
[]
[]
[]
["METADATA"]
[]
["This section collects, for each provided data, metadata on the source, the dissemination means and specific comments. "]
["Please complete the three types of information (data source, data dissemination and metadata) for each variable. For each type of information, please first select a category from the drop down menu in the blue cells (options listed below) and then specify any addition information/comment in the \"Please specify\" column beside."]
["Please click on \"Back to data\" to return to the corresponding variable in worksheet \"National data\"."]
[]
["1. Data source"," 2. Data dissemination","3. Metadata"]
["1.1 Census","2.1 Database","3.1 Reference area: Geographical coverage, for example: \"Excludes Island X\" or \"Includes only city X\""]
["1.2 Survey","2.2 Yearbook","3.2 Reference period: Time coverage, for example: \"Data actually from 2010 considered still valid\""]
["1.3 Administrative data/records","2.3 Statistical bulletin","3.3 Comparability (geographical): Break in geographical coverage, for example: \"Data excludes the newly independent region X\""]
["1.4 Estimates (please specify methodology)","2.4 Other statistical publication","3.4 Comparability (over time): Break in time-series, for example: \"Irrigation in greenhouses is  included from 2005\""]
["1.5 Unknown","2.5 Policy report","3.5 Adjustment: Change compared to the data source/dissemination, for example: \"Area given in acres in source, converted in ha with the ratio acre= x*n ha\""]
[null,"2.6 Academic paper","3.6 Overall accuracy: Any known quality issue regarding the data, for example: \"The country's municipal water withdrawal tripled in five years\""]
[null,null,"3.7. Components: Any further break-down/disaggregation available, for example: \"Flow of border rivers is 10, consisting of 5 from river A , 3 from river B and 2 from river C\""]
[null,null,"3.8. Observations: General contextual notes about the variable in the country, for example: \"Landlocked country, no desalination possible\""]
[null,null,"3.9. Methodology: If the method by which a value is derived is known but doesn't fit into any of the categories above"]
[]
{"$rows_left_out":239}
{"sheet":"SDG 6.4.1","index":5,"n_rows":66,"n_cols":11,"rows_kept":66,"cut":false,"hidden":false,"merged":[[59,3,61,3],[62,3,63,3],[3,0,3,9],[5,1,5,9]]}
[]
[]
[]
["SDG INDICATOR 6.4.1 ON WATER USE EFFICIENCY - COMPUTATION (in USD/m3)"]
[null,null,null,null,null,null,null,null,null,null," "]
[null,"This worksheet is a tool to automatically calculate the SDG indicator 6.4.1 on water use efficiency. Please do not touch: no compilation is required. It is automatically filled in based on the data you provided in the \"National Data\" worksheet and some additional data (see table below).  If the indicator is not calculated, too many variables are missing: please check if you can fill in more variables in the \"National data\" worksheet. Bright blue cells are calculated based on the automatically filled in gray blue cells."]
[]
[null,null,null,null,null,null,null,null,"Year: ",{"$f":"LOOKUP(2,1/('National data'!F20:H20),'National data'!F18:H18)","v":{"$error":"#N/A"}}]
[]
[null,"IRRIGATED AGRICULTURE WATER USE EFFICIENCY (Awe)",null,null,null,null,null,"UNIT","CALCULATION RULES"]
[]
[null,null,"Ratio between rainfed and irrigated yields",null,null,"[1]",{"$f":"I65","v":0},"decimals","AQUASTAT data (below) used if no data is entered"]
[]
[null,null,"Proportion of irrigated land on the total arable land (Ai)",null,null,"[2]",{"$f":"IF(OR(G15=\"\",G15=0), 0, (G15/G16))","v":{"$error":"#N/A"}},"decimals","=[3]/[4]"]
[null,null,null,"Irrigated land",null,"[3]",{"$f":"LOOKUP(2,1/(ISNUMBER('National data'!F56:H56)),'National data'!F56:H56)","v":{"$error":"#N/A"}},"1000 ha"]
[null,null,null,"Cultivated land",null,"[4]",{"$f":"INDEX(G64:I64, MATCH(LOOKUP(2,1/('National data'!F56:H56),'National data'!F18:H18),G59:I59,0))","v":{"$error":"#N/A"}},"1000 ha"]
[]
[null,null,"Proportion of agricultural GVA produced by rainfed agriculture (Cr)",null,null,"[5]",{"$f":"IF(G14=1,0,(IF(G12=\"\",(1/(1+(G14/((1-G14)*0.562)))),IF(G12=0,0,(1/(1+(G14/((1-G14)*G12))))))))","v":{"$error":"#N/A"}},"decimals","=(1/(1+([2]/((1-[2])*[1])))))"]
[]
[null,null,"Gross value added by agriculture ",null,null,"[7]",{"$f":"INDEX(G60:I60,MATCH(LOOKUP(2,1/('National data'!F20:H20),'National data'!F18:H18),G59:I59,0))/INDEX(G63:I63,MATCH(LOOKUP(2,1/('National data'!F20:H20),'National data'!F18:H18),G59:I59,0))*100","v":{"$error":"#N/A"}},"USD (2015 price)"]
{"$rows_left_out":47}
{"sheet":"SDG 6.4.2","index":6,"n_rows":32,"n_cols":11,"rows_kept":32,"cut":false,"hidden":false,"merged":[[28,2,28,3],[29,2,29,3],[30,2,30,3],[3,0,3,9],[17,8,17,9],[19,8,19,9],[5,1,5,9],[11,8,11,9]]}
[]
[]
[]
["SDG INDICATOR 6.4.2 ON WATER STRESS - COMPUTATION (in %)"]
[]
[null,"This worksheet is a tool to automatically calculate the SDG indicator 6.4.2 on water stress. Please do not touch: no compilation is required. It is automatically filled in based on the data you provided in the \"National Data\" worksheet and some additional data (see table below) used as default values if missing.  If the indicator is not calculated, too many variables are missing: please check if you can fill in more variables in the \"National data\" worksheet. "]
[]
[null,null,null,null,null,null,null,null,"Year: ",{"$f":"LOOKUP(2,1/('National data'!F19:H19),'National data'!F18:H18)","v":{"$error":"#N/A"}}," "]
[]
[null,"WATER STRESS",null,null,null,null,null,"UNIT",null,"CALCULATION RULES"]
[]
[null,null,"Total freshwater withdrawal (surface + groundwater)",null,null,"[1]",{"$f":"IF(AND('National data'!F29=\"\",'National data'!G29=\"\",'National data'!H29=\"\"), SUM(G13-G14-G15-G16), LOOKUP(2,1/(ISNUMBER('National data'!F29:H29)),'National data'!F29:H29))","v":{"$error":"#N/A"}},"in 10^9 m3","=[2]-[3]-[4]-[5] if missing from \"National data\" "]
[null,null,null,"Total water withdrawal",null,"[2]",{"$f":"LOOKUP(2,1/(ISNUMBER('National data'!F19:H19)),'National data'!F19:H19)","v":{"$error":"#N/A"}},"in 10^9 m3",{"$f":"IF(G13=('SDG 6.4.1'!G23+'SDG 6.4.1'!G32+'SDG 6.4.1'!G40),\"OK\",\"ERROR\")","v":{"$error":"#N/A"}}]
[null,null,null,"Desalinated water produced",null,"[3]",{"$f":"LOOKUP(2,1/(ISNUMBER('National data'!F32:H32)),'National data'!F32:H32)","v":{"$error":"#N/A"}},"in 10^9 m3"]
[null,null,null,"Direct use of treated municipal wastewater",null,"[4]",{"$f":"LOOKUP(2,1/(ISNUMBER('National data'!F33:H33)),'National data'!F33:H33)","v":{"$error":"#N/A"}},"in 10^9 m3"]
[null,null,null,"Direct use of agricultural drainage water",null,"[5]",{"$f":"LOOKUP(2,1/(ISNUMBER('National data'!F34:H34)),'National data'!F34:H34)","v":{"$error":"#N/A"}},"in 10^9 m3"]
[]
[null,null,"Total renewable freshwater resources",null,null,"[6]",{"$f":"IF('National data'!H15=\"\", I30, 'National data'!H15)","v":0},"in 10^9 m3","AQUASTAT data (below) used if no data is entered"]
[]
[null,null,"Environmental flow requirements (volume)",null,null,"[7]",{"$f":"IF('National data'!H27=\"\",I31, 'National data'!H27)","v":0},"in 10^9 m3","FAO-IMWI data (below) used if no data is entered"]
{"$rows_left_out":13}
{"sheet":"Feedback","index":7,"n_rows":66,"n_cols":9,"rows_kept":66,"cut":false,"hidden":false,"merged":[[3,0,3,13],[5,0,5,13],[25,8,25,12],[32,0,32,1],[32,8,32,12],[25,0,25,1],[67,1,67,8],[11,0,11,1],[11,8,11,12],[18,0,18,1],[18,8,18,12],[39,0,39,1],[39,8,39,12],[46,8,46,12],[51,1,51,8],[55,1,55,8],[59,1,59,8],[63,1,63,8],[46,0,46,1]]}
[]
[]
[]
["FEEDBACK"]
[]
["The methodology used in this questionnaire is regularly reviewed to improve its efficiency, reduce reporting burden and identify areas for improvement. Feedback from reporting officers is thus particularly appreciated and encouraged.\nIn case more than one respondents has contributed to the compilation of the questionnaire, this worksheet is to be filled-out by the focal point (indicated in the cover)  gathering this information from all contributors."]
[]
["1. The questionnaire was initially addressed to the right person"]
[]
[]
[null,null,"Strongly agree","Agree","Partially agree","Disagree","Strongly disagree",null,"Please specify the right person, title, and email (if needed):"]
["Please type \"X\" in the relevant box:"]
[]
[]
["2. The questionnaire is logically structured and contains clear instructions for its completion"]
[]
[]
[null,null,"Strongly agree","Agree","Partially agree","Disagree","Strongly disagree",null,"Please specify:"]
["Please type \"X\" in the relevant box:"]
[]
{"$rows_left_out":47}
{"sheet":" (Hidden) Other SDG data","index":8,"n_rows":14,"n_cols":6,"rows_kept":14,"cut":false,"hidden":true,"merged":[[6,0,8,0],[9,0,10,0],[3,0,3,6],[11,0,13,0],[11,3,11,4],[12,3,12,4],[13,3,13,4]]}
[]
[]
[]
["OTHER SDG DATA"]
[]
["Source","Variable","Unit",2015,2016,2017]
["UNSD","Agriculture, value added to GDP","US$ current"]
[null,"Industry, value added to GDP (MIMEC)","US$ current"]
[null,"Services, value added to GDP","US$ current"]
["FAOSTAT","GDP Deflator (2015)","-"]
[null,"Cultivated land (Arable land + Permanent crop)","1000 ha"]
["AQUASTAT","Ratio between rainfed and irrigated yields","%"]
[null,"Total renewable freshwater resources","10^9 m3/yr"]
[null,"Environmental flow requirements (volume)","10^9 m3/yr"]